{"text_format":"1","workbook":"xlsx","n_sheets":14,"sheets":["Disclaimer","Instructions","Configuration","Summary","Intel Chassis","Serverboard Config","Serverboard","Chassis","Processors","Memory","PCI","HardDrive","Peripherals","Revision"],"not_rendered":{"charts":0,"images":1,"macros":1,"external_links":0,"defined_names":78,"comments":2,"pivot_tables":0},"unopened":[],"bounds":{"document_bytes":16777216,"sheet_cells":100000,"rows_first":2000,"rows_last":500,"rows_between":2000,"halvings":0,"cell_chars":16384,"cell_head_chars":4096},"cells_cut":0,"cells_raw":0,"read":"whole","date_system":"1900"}

{"sheet":"Disclaimer","index":0,"n_rows":0,"n_cols":0,"rows_kept":0,"cut":false,"hidden":false,"merged":[]}

{"sheet":"Instructions","index":1,"n_rows":1,"n_cols":1,"rows_kept":1,"cut":false,"hidden":false,"merged":[]}
["        Power Budget Instructions"]

{"sheet":"Configuration","index":2,"n_rows":60,"n_cols":27,"rows_kept":60,"cut":false,"hidden":false,"merged":[[55,0,57,0],[58,0,59,0],[7,0,17,0],[31,0,35,0],[36,0,41,0],[42,0,47,0],[18,0,30,0],[48,0,54,0],[6,21,6,25],[1,0,1,1],[1,2,1,4],[1,5,1,8],[1,17,1,20],[1,21,1,25],[2,0,3,0],[4,0,5,0],[6,2,6,4],[6,5,6,8],[6,17,6,20],[1,9,1,12],[6,9,6,12],[1,13,1,16],[6,13,6,16]]}
["Thermal Config Matrix",null,null,null,null,null,null,null,null,null,null,null,null,null,null,null,null,{"$f":"Summary!D15","v":{"$error":"#DIV/0!"}},"<-- Margin to PS rating"]
["Notes:\n1.  The 25°C configuration alone is limited to elevations of 900m or less\n2.  Use of the designated  PCI slot is limited to add-in cards that have air flow requirements of 100 LFM or less. See add-in card specs for air flow requirements. \n3.  Base system SKUs R2312GZ/GL and R2224GZ/GL, configured with the following IO modules: AXX10GBTWLIOM, AXX2FDRIBIOM and AXX1FDRIBIOM, can only be supported with DRx8 memory.\n4. 130W-4 Core and 135W-8 Core processors may experience throttling, impacting system performance.\n5.  Processor throttling may occur with a system fan failure which may impact system performance.\n6.  Specifically for A3/A4 individual Power Supply selection power  margin is required to meet thermal specifications:\n      a) For dual power supply configuration, power budget must fit within  single power supply rated load and be installed in dual configuration, or\n      b) For single power supply configuration, power budget must be sized with 30% margin to single power supply rated load.\n7.  GPGPU cards may have performance impact during ambient excursions\n8.  When identifying memory in the table, only Rank and Width are required.  Capacity is not required.\n9.  LV refers to low voltage DIMMs (1.35V)\n10.  Cache offload Module can only be installed with 95W processor and DRx8 or equivalent memory for HTA A3/A4 with R2312GZ/GL and R2224GZ/GL System.  Requires an optional RMFBU2 bracket on 2U systems.     \n11. Confirm the case temperature specification for the SSD to make appropriate selection\n12.  Fan fail of dual-rotor fans refers to one rotor fail. \"Fan Fail Support\" indicates if fan fail can be supported with specified configuration in each column.\n13. System must have contents from the Intel accessory kit AGZCOPRODUCT installed to support Intel® Xeon Phi™ or non-Intel GPGPU add-in cards with passive cooling solutions. Only systems configured with S2600GZ (24-DIMM) server board will be supported.\n14. Fan redundancy is not supported in systems configured with 130W-4 Core and 135W-8 Core processors \n15. Due to thermal specification availability restrictions, Intel has NOT verified the thermal compatibility of non-Intel GPGPU cards that utilize a passive cooling solution in its server systems. System integrators should verify non-Intel add-in card air flow requirements from available vendor specifications before integrating them into the system.",null,"Base System SKUs:                     R1304GZ/GL R1208GZ/GL",null,null,"Base System SKUs:    R2312GZ/GL  ",null,null,null,"Base System SKUs:      R2224GZ/GL",null,null,null,"Base System SKUs:     R2216GZ/GL",null,null,null,"Base System SKUs:    R2308GZ/GL ",null,null,null," Base System SKUs:                 R2208GZ/GL"]
["ASHRAE (See note 1)","Classifications","A2","A3","A4","25C","A2","A3","A4","25C","A2","A3","A4","25C","A2","A3","A4","25C","A2","A3","A4","25C","A2","A2","A3","A4","<-- see note 1"]
[null,"Max Ambient","35°C","40°C","45°C","25°C","35°C","40°C","45°C","25°C","35°C","40°C","45°C","25°C","35°C","40°C","45°C","25°C","35°C","40°C","45°C","25°C","35°C","35°C","40°C","45°C"]
["Cooling","Redundant Fan  Configuration","●","●","●","●","●","●","●","●","●","●","●","●","●","●","●","●","●","●","●","●","●","●","●","●"]
[null,"Redundancy Available","●",null,null,"●","●",null,null,"●","●",null,null,"●","●",null,null,"●","●",null,null,"●",null,"●"]
["PS (See note 6)","Power Supplies","See Tool",null,null,"See Tool",null,null,null,"See Tool",null,null,null,"See Tool",null,null,null,"See Tool",null,null,null,"See Tool",null,null,null,null,"<-- see note 6"]
["EP Processors\n( See Notes 4,5)","EP, 60w, 6C (Intel® Xeon® processor E5-2630L)","●","●",null,"●","●",null,null,"●","●",null,null,"●","●","●","●","●","●","●","●","●","●","●","●","●","<-- see note 5"]
[null,"EP, 70w, 8C (Intel® Xeon® processor E5-2650L)","●","●","●","●","●","●",null,"●","●","●",null,"●","●","●","●","●","●","●","●","●","●","●","●","●","<-- see note 5"]
[null,"EP, 95w, 6C (Intel® Xeon®processor E5-2620 , E5-2630, E5-2640)","●","●","●","●","●","●","●","●","●","●","●","●","●","●","●","●","●","●","●","●","●","●","●","●","<-- see note 5"]
{"$rows_left_out":51}
{"sheet":"Summary","index":3,"n_rows":34,"n_cols":9,"rows_kept":34,"cut":false,"hidden":false,"merged":[[0,1,0,3]]}
["Power Budget",{"$f":"CONCATENATE(INDEX(Chassis!$L$3:$L$13,'Intel Chassis'!$B3),\" / \",INDEX(Serverboard!A$2:A$13,'Serverboard Config'!$B5) )","v":"(Select a Chassis) / (Select Serverboard)"}]
["Chassis/ Power Supply / Cooling:",{"$f":"INDEX(Chassis!A$3:A$13,'Intel Chassis'!$B3)","v":"(Select Chassis)"}]
["Serverboard:",{"$f":"INDEX(Serverboard!A$2:A$13,'Serverboard Config'!$B5)","v":"(Select Serverboard)"}]
["System Totals"," +12V (amps)","12VSB (amps)","Total System Watts "]
[{"$f":"CONCATENATE(\"Processors - Qty \",'Serverboard Config'!C4, \":\")","v":"Processors - Qty 1:"},{"$f":"SUM('Serverboard Config'!F3)","v":0},{"$f":"SUM('Serverboard Config'!G3)","v":0},{"$f":"SUM('Serverboard Config'!H3)","v":0}]
[{"$f":"CONCATENATE(\"Modules + PCI Cards - Qty \",('Serverboard Config'!B7>1) + ('Serverboard Config'!B8>1) + ('Serverboard Config'!B9>1) + ('Serverboard Config'!B10>1) +('Serverboard Config'!B11>1)+('Serverboard Config'!B12>1)+('Serverboard Config'!B13>1)+('Serverboard Config'!B15>1)+('Serverboard Config'!B16>1),\":\")","v":"Modules + PCI Cards - Qty 0:"},{"$f":"SUM('Serverboard Config'!F7:F16)","v":0},{"$f":"SUM('Serverboard Config'!G7:G16)","v":0},{"$f":"SUM('Serverboard Config'!H7:H16)","v":0}]
[{"$f":"CONCATENATE(\"Hard Drives - Qty \",'Intel Chassis'!C4+'Intel Chassis'!C5,\":\")","v":"Hard Drives - Qty 0:"},{"$f":"SUM('Intel Chassis'!G4:G5)","v":0},0,{"$f":"SUM('Intel Chassis'!I4:I5)","v":0}]
["Serverboard & Memory:",{"$f":"SUM('Serverboard Config'!F5:F6)","v":0},{"$f":"SUM('Serverboard Config'!G5:G6)","v":0},{"$f":"SUM('Serverboard Config'!H5:H6)","v":0}]
["Chassis & Peripherals:",{"$f":"_Sys12 - B7","v":0},{"$f":"'Intel Chassis'!H12","v":0},{"$f":"3.3*Sys3.3+5*_Sys5+ 12*_Sys12-D7","v":0}]
["System Totals:",{"$f":"SUM(B5:B9)","v":0},{"$f":"SUM(C5:C9)","v":0},{"$f":"SUM(D5:D9)","v":0}]
{"$rows_left_out":25}
{"sheet":"Intel Chassis","index":4,"n_rows":19,"n_cols":11,"rows_kept":19,"cut":false,"hidden":false,"merged":[]}
["Power Budget",{"$f":"CONCATENATE(INDEX(Chassis!$L$3:$L$13,B3), \" System Configuration\")","v":"(Select a Chassis) System Configuration"},null,null,null,null,null,null,null,null,"HSBP VRM Efficiency"]
["System Feature","Description","Qty",null,"+3.3V (amps)","+5V (amps)"," +12V (amps)","12V \nstby (amps)","Power\n(watts)",null,{"$f":"INDEX(Chassis!$G$3:$G$13,B3)","v":1}]
["Chassis:",1,null,null,null,null,{"$f":"INDEX(Chassis!$E$3:$E$13,B3)+IF(INDEX(Chassis!$F$3:$F$13,B3)=\"Y\",(INDEX(Processors!C2:C33,'Serverboard Config'!B3)*'Serverboard Config'!C4),0)","v":0},null,{"$f":"G3*12+H3*12","v":0}," Includes System Fans "]
["1st Hard Drive Type: ",1,0,null,null,{"$f":"INDEX(HardDrive!$C$2:$C$16,B4) *C4 * 1","v":0},{"$f":"(INDEX(HardDrive!$D$2:$D$16,B4)*C4+((F4*5)/12)/$K$2) *1","v":0},null,0,{"$f":"IF(C4+C5>(INDEX(HardDrive!$F$19:$F$31*$C$6,'Intel Chassis'!$B$6)),\" <-- Max Supported HDD Count Exceeded!\",\" \")","v":" "}]
["2nd Hard Drive Type: ",1,0,null,null,{"$f":"INDEX(HardDrive!$C$2:$C$16,B5) *C5 *1","v":0},{"$f":"(INDEX(HardDrive!$D$2:$D$16,B5) *C5+((F5*5)/12)/$K$2) *1","v":0},null,0,{"$f":"IF(C4+C5>(INDEX(HardDrive!$F$19:$F$31*$C$6,'Intel Chassis'!$B$6)),\" <-- Max Supported HDD Count Exceeded!\",\" \")","v":" "}]
["Backplane: ",1,0,null,null,null,{"$f":"(INDEX(HardDrive!$D$19:$D$31,B6) *C6+((F6*5)/12)/$K$2) *1","v":0},null,0]
["Midplane Expander: ",1,1,null,null,null,{"$f":"(INDEX(Peripherals!$D$21:$D$27,B7) *C7) *1","v":0},null,0]
["USB: ","Number of Devices (100mA/device)",0,null,null,{"$f":"0.1*C8","v":0},{"$f":"((F8*5)/12)/_5vVRM","v":0},null,0]
["Display: ","Optional LCP",0,null,null,null,null,{"$f":"(0.171*3.3)/12/_stbyVRM*C9","v":0},0]
["Slim-line Bay: ",1,1,null,null,{"$f":"INDEX(Peripherals!C$3:C$9,$B10) *C10","v":0},{"$f":"(INDEX(Peripherals!$D$3:$D$9,B10)*C10+((F10*5)/12)/_5vVRM) *1","v":0},null,0]
{"$rows_left_out":10}
{"sheet":"Serverboard Config","index":5,"n_rows":31,"n_cols":17,"rows_kept":31,"cut":false,"hidden":false,"merged":[[0,1,0,7]]}
["Power Budget",{"$f":"CONCATENATE(INDEX(Serverboard!A$2:A$13,$B5),\" Configuration\")","v":"(Select Serverboard) Configuration"},null,null,null,null,null,null,null,"CPU VRM Efficiency","Mem VR Efficiency","3.3v VRM Efficiency","5v VRM Efficiency","3.3 Stby VR Efficiency"]
["Serverboard Feature","Description",null,"+3.3V (amps)","+5V (amps)"," +12V (amps)","12V \nstby (amps)","Power (watts)",null,{"$f":"INDEX(Serverboard!E$2:E$11,$B5)","v":1},{"$f":"INDEX(Serverboard!F$2:F$11,$B5)","v":0},{"$f":"INDEX(Serverboard!G$2:G$11,$B5)","v":1},{"$f":"INDEX(Serverboard!H$2:H$11,$B5)","v":1},{"$f":"INDEX(Serverboard!I$2:I$11,$B5)","v":1},"<--Hide these columns"]
["Processors:",1,null,null,null,{"$f":"C4*INDEX(Processors!B$2:B$33,$B3)/12/VRMefficiency*0.9","v":0},null,{"$f":"F3*12+E3*5","v":0}]
[null,"Quantity:",1]
["Serverboard:",1,null,null,null,{"$f":"INDEX(Serverboard!B$2:B$13,$B5) *1","v":0},{"$f":"INDEX(Serverboard!C$2:C$13,$B5) *1","v":0},{"$f":"INDEX(Serverboard!D$2:D$13,$B5) *1","v":0}]
["Memory:",1,1,null,null,{"$f":"IF(C6=1,0,((HLOOKUP(INDEX(Memory!A28:A38,$C6),Memory!B5:I18,B6+2,FALSE))/12/_MemVR*0.9))","v":0},null,{"$f":"D6*3.3+E6*5+F6*12+G6*12","v":0},{"$f":"IF(C6=1,\"\",IF(HLOOKUP(INDEX(Memory!A28:A38,$C6),Memory!B5:I18,B6+2,FALSE)=\"na\",\"<-- unsupported DIMM config\",\"\"))","v":""}]
["PCI Card #1:",1,null,{"$f":"INDEX(PCI!B$2:B$17,$B7)","v":0},{"$f":"INDEX(PCI!C$2:C$17,$B7)","v":0},{"$f":"INDEX(PCI!D$2:D$17,$B7)+((D7*3.3)/12)/$L$2+((E7*5)/12)/$M$2","v":0},{"$f":"((INDEX(PCI!$E$2:$E$17,$B7)*3.3)+(INDEX(PCI!$F$2:$F$17,$B7))*5)/12/_stbyVRM","v":0},{"$f":"F7*12+G7*12","v":0}]
["PCI Card #2:",1,null,{"$f":"INDEX(PCI!B$2:B$17,$B8)","v":0},{"$f":"INDEX(PCI!C$2:C$17,$B8)","v":0},{"$f":"INDEX(PCI!D$2:D$17,$B8)+((D8*3.3)/12)/$L$2+((E8*5)/12)/$M$2","v":0},{"$f":"((INDEX(PCI!$E$2:$E$17,$B8)*3.3)+(INDEX(PCI!$F$2:$F$17,$B8))*5)/12/_stbyVRM","v":0},0]
["PCI Card #3:",1,null,{"$f":"INDEX(PCI!B$2:B$17,$B9)","v":0},{"$f":"INDEX(PCI!C$2:C$17,$B9)","v":0},{"$f":"INDEX(PCI!D$2:D$17,$B9)+((D9*3.3)/12)/$L$2+((E9*5)/12)/$M$2","v":0},{"$f":"((INDEX(PCI!$E$2:$E$17,$B9)*3.3)+(INDEX(PCI!$F$2:$F$17,$B9))*5)/12/_stbyVRM","v":0},0]
["PCI Card #4:",1,null,{"$f":"INDEX(PCI!B$2:B$17,$B10)","v":0},{"$f":"INDEX(PCI!C$2:C$17,$B10)","v":0},{"$f":"INDEX(PCI!D$2:D$17,$B10)+((D10*3.3)/12)/$L$2+((E10*5)/12)/$M$2","v":0},{"$f":"((INDEX(PCI!$E$2:$E$17,$B10)*3.3)+(INDEX(PCI!$F$2:$F$17,$B10))*5)/12/_stbyVRM","v":0},0]
{"$rows_left_out":22}
{"sheet":"Serverboard","index":6,"n_rows":11,"n_cols":10,"rows_kept":11,"cut":false,"hidden":false,"merged":[]}
["Serverboard",12,"12VSB","Watts","CPU VR\nEff%","Mem VR Eff%","5v VR\nEff%","3v VR\nEff%","Stby/Aux Eff%"]
["(Select Serverboard)",null,null,null,1,null,1,1,1]
["S2600GZ Serverboard",{"$f":"32/12","v":2.6666666666666665},{"$f":"0.414/12/0.9","v":3.833333333333333E-2},{"$f":"B3*12+C3*12","v":32.46},0.85,0.84,0.85,0.9,0.87,"Pwr Budget v6"]
["S2600GL Serverboard",{"$f":"32/12","v":2.6666666666666665},{"$f":"0.414/12/0.9","v":3.833333333333333E-2},{"$f":"B4*12+C4*12","v":32.46},0.85,0.84,0.85,0.9,0.87,"Pwr Budget v6"]
[null,null,null,0,0.8,0.8,0.8,0.8,0.8,"<-- Define Custom Numbers Here"]
[null,null,null,0,0.8,0.8,0.8,0.8,0.8,"<-- Define Custom Numbers Here"]
[null,null,null,0,0.8,0.8,0.8,0.8,0.8,"<-- Define Custom Numbers Here"]
[null,null,null,0,0.8,0.8,0.8,0.8,0.8,"<-- Define Custom Numbers Here"]
[null,null,null,0,0.8,0.8,0.8,0.8,0.8,"<-- Define Custom Numbers Here"]
[null,null,null,0,0.8,0.8,0.8,0.8,0.8,"<-- Define Custom Numbers Here"]
{"$rows_left_out":2}
{"sheet":"Chassis","index":7,"n_rows":18,"n_cols":21,"rows_kept":18,"cut":false,"hidden":false,"merged":[[0,1,0,2],[0,16,0,19],[0,12,0,15],[0,7,0,10]]}
["Chassis",null,null,"Total","Fans","HS Fan","HSBP ","PS Eff%",null,null,null,"Product Name","Total 12 DC Current (Amps)",null,null,null,"Total DC Ouput (Watts)"]
["Selection","12V","12VSB","Watts","12V","(Y/N)","VR Eff%","220VAC","115VAC","-48DCV","-60DCV",null,"220VAC","115VAC","-48DCV","-60DCV","220VAC","115VAC","-48DCV","-60DCV"]
["(Select Chassis)",null,null,null,null,null,1,1,1,1,1,"(Select a Chassis)"]
["R1XXX (1U 750W AC PSU)",{"$f":"INDEX(M4:P4,Summary!$B$19)","v":62},2.1,{"$f":"INDEX(Q4:T4,Summary!$B$19)","v":750},{"$f":"6*1.3","v":7.8000000000000007},"N",0.9,0.94,0.92,"na","na","R1XXX",62,62,62,62,750,750,750,750,"PS Eff% from measured curves"]
["R1XXX (1U 460W AC PSU)",{"$f":"INDEX(M5:P5,Summary!$B$19)","v":38},2.1,{"$f":"INDEX(Q5:T5,Summary!$B$19)","v":460},{"$f":"6*1.3","v":7.8000000000000007},"N",0.9,0.92,0.89,"na","na","R1XXX",38,38,38,38,460,460,460,460,"PS Eff% from measured curves"]
["R2XXX (2U 750W AC PSU)",{"$f":"INDEX(M6:P6,Summary!$B$19)","v":62},2.1,{"$f":"INDEX(Q6:T6,Summary!$B$19)","v":750},{"$f":"5*1.6","v":8},"N",0.9,0.94,0.92,"na","na","R2XXX",62,62,62,62,750,750,750,750,"PS Eff% from measured curves"]
["R2XXX (2U 460W ACPSU)",{"$f":"INDEX(M7:P7,Summary!$B$19)","v":38},2.1,{"$f":"INDEX(Q7:T7,Summary!$B$19)","v":460},{"$f":"5*1.6","v":8},"N",0.9,0.92,0.89,"na","na","R2XXX",38,38,38,38,460,460,460,460,"PS Eff% from measured curves"]
["R2XXX (2U 750W DC PSU)",{"$f":"INDEX(M8:P8,Summary!$B$19)","v":62},2.1,{"$f":"INDEX(Q8:T8,Summary!$B$19)","v":750},{"$f":"5*1.6","v":8},"N",0.9,"na","na",0.9,0.9,"R2XXX",62,62,62,62,750,750,750,750,"PS Eff% from measured curves"]
["User Definable",{"$f":"INDEX(M9:P9,Summary!$B$19)","v":0},null,{"$f":"INDEX(Q9:T9,Summary!$B$19)","v":0},null,"N",0.8,0.8,0.8,0.8,0.8,null,null,null,null,null,null,null,null,null,"<-- Define Custom Numbers Here"]
["User Definable",{"$f":"INDEX(M10:P10,Summary!$B$19)","v":0},null,{"$f":"INDEX(Q10:T10,Summary!$B$19)","v":0},null,"N",0.8,0.8,0.8,0.8,0.8,null,null,null,null,null,null,null,null,null,"<-- Define Custom Numbers Here"]
{"$rows_left_out":9}
{"sheet":"Processors","index":8,"n_rows":43,"n_cols":7,"rows_kept":43,"cut":false,"hidden":false,"merged":[]}
["Processor Types","TDP (W)","HS Fan (A)","Source",null,"VRM#1","VRM#2"]
["(Select Processor)",null,null,null,null,"5V VRM","12V VRM"]
["Intel Xeon® E5-2690 v2 (130W)",130,null,"EDS rev1.5 - Intel Doc #511819"]
["Intel Xeon® E5-2680 v2 (115W)",115,null,"EDS rev1.5 - Intel Doc #511819"]
["Intel Xeon® E5-2670 v2 (115W)",115,null,"EDS rev1.5 - Intel Doc #511819"]
["Intel Xeon® E5-2667 v2 (130W)",130,null,"EDS rev1.5 - Intel Doc #511819"]
["Intel Xeon® E5-2660 v2 (95W)",95,null,"EDS rev1.5 - Intel Doc #511819"]
["Intel Xeon® E5-2650 v2 (95W)",95,null,"EDS rev1.5 - Intel Doc #511819"]
["Intel Xeon® E5-2640 v2 (95W)",95,null,"EDS rev1.5 - Intel Doc #511819"]
["Intel Xeon® E5-2630 v2 (80W)",80,null,"EDS rev1.5 - Intel Doc #511819"]
{"$rows_left_out":34}
{"sheet":"Memory","index":9,"n_rows":38,"n_cols":10,"rows_kept":38,"cut":false,"hidden":false,"merged":[[3,1,3,8],[0,1,0,8]]}
[null,"Watts of +12V"]
[]
[null,"1DPC","1DPC","1DPC","1DPC","1&2DPC","2DPC","2&3DPC","3DPC"]
[null,"# of DIMMS"]
["Memory",1,2,4,8,12,16,20,24]
[]
["(Select Memory)"]
["8GB DDR3 RDIMM (4Gb, DRx8)",{"$f":"5.2*B$5","v":5.2},{"$f":"5.2*C$5","v":10.4},20.8,41.6,{"$f":"5.2*4 +5.2*8","v":62.400000000000006},{"$f":"5.2*16","v":83.2},{"$f":"5.2*16+3.9*4","v":98.8},{"$f":"3.9*24","v":93.6}]
["16GB DDR3 RDIMM (4Gb, DRx4)",{"$f":"8.3*B$5","v":8.3000000000000007},{"$f":"8.3*C$5","v":16.600000000000001},33.200000000000003,66.400000000000006,{"$f":"8.3*4 +7.4*8","v":92.4},{"$f":"7.4*16","v":118.4},{"$f":"7.4*16+5*4","v":138.4},{"$f":"5*24","v":120}]
["32GB DDR3 LR-DIMM (4Gb, QRx4)",{"$f":"14.9*B$5","v":14.9},{"$f":"14.9*C$5","v":29.8},59.6,119.2,{"$f":"14.9*4 +11.8*8","v":154},{"$f":"11.8*16","v":188.8},{"$f":"11.8*16+8.2*4","v":221.60000000000002},{"$f":"8.2*24","v":196.79999999999998}]
{"$rows_left_out":29}
{"sheet":"PCI","index":10,"n_rows":48,"n_cols":8,"rows_kept":48,"cut":false,"hidden":false,"merged":[]}
["PCI Add in Cards","Amps of +3.3V","Amps of +5V","Amps of +12V","Amps of    3.3V Stby","Amps of    5V Stby","Watts"]
["Slot Empty",null,null,null,null,null," "]
["PCI-X (5V) Typical",null,2,null,null,null,{"$f":"B3*3.3+C3*5+D3*12+E3*3.3+F3*5","v":10}]
["PCIe (3V) Typical",3,null,null,null,null,9.8999999999999986]
["PCIe (3.3V / 12V) Typical",2,null,0.25,null,null,9.6]
["PCIe (3.3V / 12V) High",2,null,0.7,null,null,14.999999999999998]
["RMS25PB080 (PCIe ROC)",0.86,null,0.55000000000000004,0.2,null,{"$f":"B7*3.3+C7*5+D7*12+E7*3.3","v":10.098000000000001}]
["RES2SV240 (24-port Expander)",null,null,0.97,null,null,{"$f":"B8*3.3+C8*5+D8*12+E8*3.3","v":11.64}]
["User Definable ",null,null,null,null,null,{"$f":"B9*3.3+C9*5+D9*12+E9*3.3+F9*5","v":0},"<-- Define Custom Card Here"]
["User Definable ",null,null,null,null,null,0,"<-- Define Custom Card Here"]
{"$rows_left_out":39}
{"sheet":"HardDrive","index":11,"n_rows":31,"n_cols":7,"rows_kept":31,"cut":false,"hidden":false,"merged":[]}
["Hard Drives","Amps of +3.3V","Amps of +5V","Amps of +12V","Watts"]
["Empty"]
["3.5\" SATA Typical Power (12W)",null,0.5,0.8,{"$f":"B3*3.3+C3*5+D3*12","v":12.100000000000001}]
["3.5\" SAS Typical Power (15W)",null,0.8,0.92,{"$f":"B4*3.3+C4*5+D4*12","v":15.040000000000001}]
["2.5\" SATA Typical Power (5W)",null,1,0,5]
["2.5\" SAS Typical Power (9W)",null,0.81,0.41,8.9700000000000006]
["3.5\" Seagate ST33000650SS Constellation ES.2",null,0.74,0.49,9.58,null,"<-- Define Custom Device Here"]
["3.5\" SAS Seagate ST3600057SS Cheetah 15K.7",null,0.45,1.17,16.29,null,"<-- Define Custom Device Here"]
["2.5\" SAS Seagate ST91000640SS Constellation.2",null,1,0.17,7.04,null,"<-- Define Custom Device Here"]
["2.5\" SAS Seagate ST9146852SS Savvio 15K.2",null,0.43,0.4,6.9500000000000011,null,"<-- Define Custom Device Here"]
{"$rows_left_out":22}
{"sheet":"Peripherals","index":12,"n_rows":27,"n_cols":7,"rows_kept":27,"cut":false,"hidden":false,"merged":[]}
["Misc Peripherals","Amps of +3.3V","Amps of +5V","Amps of +12V","Amps of 3VSB","Watts"]
["Slim-Line Devices"]
["Empty"]
["AXXSATADVDROM",null,0.7,null,null,{"$f":"B4*3.3+C4*5+D4*12++E4*3.3","v":3.5}]
["AXXSATADVDRWROM",null,0.8,null,null,{"$f":"B5*3.3+C5*5+D5*12++E5*3.3","v":4}]
["User Definable",null,null,null,null,0,"<-- Define Custom Peripherals Here"]
["User Definable",null,null,null,null,0,"<-- Define Custom Peripherals Here"]
["User Definable",null,null,null,null,0,"<-- Define Custom Peripherals Here"]
["User Definable",null,null,null,null,0,"<-- Define Custom Peripherals Here"]
[]
{"$rows_left_out":18}
{"sheet":"Revision","index":13,"n_rows":10,"n_cols":4,"rows_kept":10,"cut":false,"hidden":false,"merged":[]}
[{"$f":"MAX(A4:A27)","v":"2013-08-27"},{"$f":"MAX(B4:B27)","v":2.4},null,"<=== Linked to Summary Tab."]
[]
["Date","Rev","Notes","Init"]
["2011-12-22",0.5,"Initial Draft for review","dls"]
["2011-12-23",1,"Initial Release","dls"]
["2012-03-27",2,"Added Thermal Configuraiton data","dls"]
["2012-04-11",2.1,"Changes some labeleing and formatting","dls"]
["2012-09-10",2.2000000000000002,"Updated Config Tab & adjusted CLST value","dls"]
["2012-11-12",2.2999999999999998,"Corrected formatting errors and typos","dls"]
["2013-08-27",2.4,"Added IVB CPU support","mj"]