{"text_format":"1","workbook":"xlsx","n_sheets":15,"sheets":["Disclaimer","Instructions","Normal Config","Fan Fail Config","Summary","Intel Chassis","Serverboard Config","Serverboard","Chassis","Processors","Memory","PCI","HardDrive","Peripherals","Revision"],"not_rendered":{"charts":0,"images":0,"macros":1,"external_links":0,"defined_names":118,"comments":2,"pivot_tables":0},"unopened":[],"bounds":{"document_bytes":16777216,"sheet_cells":100000,"rows_first":2000,"rows_last":500,"rows_between":2000,"halvings":0,"cell_chars":16384,"cell_head_chars":4096},"cells_cut":0,"cells_raw":0,"read":"whole","date_system":"1900"}

{"sheet":"Disclaimer","index":0,"n_rows":0,"n_cols":0,"rows_kept":0,"cut":false,"hidden":false,"merged":[]}

{"sheet":"Instructions","index":1,"n_rows":1,"n_cols":1,"rows_kept":1,"cut":false,"hidden":false,"merged":[]}
["          Power Budget Instructions"]

{"sheet":"Normal Config","index":2,"n_rows":61,"n_cols":30,"rows_kept":61,"cut":false,"hidden":false,"merged":[[44,0,45,0],[46,0,50,0],[51,0,55,0],[56,0,60,0],[3,0,4,0],[5,0,7,0],[8,0,19,0],[20,0,22,0],[23,0,28,0],[29,0,30,0],[31,0,38,0],[39,0,41,0],[42,0,43,0],[1,2,1,5],[1,0,2,1],[1,26,1,29],[2,2,2,29],[1,6,1,9],[1,10,1,13],[1,14,1,17],[1,18,1,21],[1,22,1,25]]}
["Normal Mode Thermal Config Matrix",null,null,null,null,null,null,null,null,null,null,null,null,{"$f":"Summary!D15","v":0.91272727272727272},"<-- Margin to PS rating"]
["Notes:\n1.  The 27°C configuration alone is limited to elevations of 900m or less. Altitudes higher than 900m need to be de-rated to ASHRAE Class 2 levels.\n2.  To support system fan redundancy, the system must be configured with two power supplies to maintain sufficient cooling. Concurrent system and power supply fan failures is not supported.\n3.  Processor throttling may occur which may impact system performance. CPU reliability is not impacted.\n4. In fan fail mode, Intel® I/O Modules AXX10GBTWLIOM and AXX2FDRIBIOM are only supported in the specified base system model configured with 120W processors and DRx4 memory.  \n5. Use of the designated PCIe* slot is limited to add-in cards that have air flow requirements of 100 LFM or less. See add-in card specs for air flow requirements.\n6. For ASHRAE Class 3 and Class 4 support, the following power supply margining is required to meet thermal specifications:\na) For dual power supply configurations, the power budget must fit within  a single power supply rated load and be installed in a dual configuration, or\nb) For single power supply configurations, the power budget must be sized with 30% margin to single power supply rated load.\n7. Intel® Xeon Phi™ or non-Intel GPGPU cards may have performance impact during ASHRAE Class 3 and Class 4 ambient air excursions.\n8. PCIe* SSD AIC FF devices can only be supported in the bottom add-in card slot on Riser Slot #1 and Riser Slot #2. \n9. The Intel® RAID Maintenance Free Backup Unit (AXXRMFBUx) can support a case temperature of up to 45°C with the system operating in normal mode and up to 55°C with the system operating in a fan fail mode. The case temperature of Intel® Smart RAID Battery (AXXRSBBUx) can support up to 45°C in both normal and fan fail mode.  Excursions over these specs may result in a reliability impact.  \n10. The system must be configured with Intel® accessory kits AWTCOPRODUCT and A2UL16RISER2 in order to support Intel® Xeon Phi™ or Non-Intel GPGPU add-in cards with passive cooling solutions.",null,"Base System SKUs:\nR1304WT/R1208WT",null,null,null,"Base System SKUs:    R2312WT",null,null,null,"Base System SKUs:      R2224WT",null,null,null,"Base System SKUs:    \nR2308WT R2216WT",null,null,null," Base System SKUs:                 R2208WT",null,null,null,"Base System SKUs:    \nR2308WT R2216WT \nwith AWTCOPRODUCT  ",null,null,null," Base System SKUs:                 R2208WT with duct\nAWTCOPRODUCT"]
[null,null," \"●\"= Full Support without limitation;  \"4,5\"(Cell with number)=Conditional support with limitation;\n\" \"(Blank)=Not support; "]
["ASHRAE (See note 1)","Classifications","27C","A2","A3","A4","27C","A2","A3","A4","27C","A2","A3","A4","27C","A2","A3","A4","27C","A2","A3","A4","27C","A2","A3","A4","27C","A2","A3","A4"]
[null,"Max Ambient","27°C(1)","35°C","40°C","45°C","27°C(1)","35°C","40°C","45°C","27°C(1)","35°C","40°C","45°C","27°C(1)","35°C","40°C","45°C","27°C(1)","35°C","40°C","45°C","27°C(1)","35°C","40°C","45°C","27°C(1)","35°C","40°C","45°C"]
["PS (See note 6)","1100W AC","●","●","●","●","●","●","●","●","●","●","●","●","●","●","●","●","●","●","●","●","●","●","●","●","●","●","●","●"]
[null,"750W AC","●","●","●","●","●","●","●","●","●","●","●","●","●","●","●","●","●","●","●","●","●","●","●","●","●","●","●","●"]
[null,"750W DC","●","●","●","●","●","●","●","●","●","●","●","●","●","●","●","●","●","●","●","●","●","●","●","●","●","●","●","●"]
["EP Processors\n( See Notes 3)","EP, 135w, 12C  (Intel® Xeon® processor E5-2690 V3)","●","●","●","●","●","●","●",3,"●","●","●",3,"●","●","●","●","●","●","●","●","●","●",3,3,"●","●","●","●"]
[null,"EP, 120w, 12C  (Intel® Xeon® processor E5-2680 V3, E5-2670 V3)","●","●","●","●","●","●","●",3,"●","●","●",3,"●","●","●","●","●","●","●","●","●","●",3,3,"●","●","●","●"]
{"$rows_left_out":52}
{"sheet":"Fan Fail Config","index":3,"n_rows":61,"n_cols":30,"rows_kept":61,"cut":false,"hidden":false,"merged":[[31,0,38,0],[39,0,41,0],[42,0,43,0],[46,0,50,0],[51,0,55,0],[44,0,45,0],[1,22,1,25],[1,26,1,29],[2,2,2,29],[56,0,60,0],[3,0,4,0],[1,0,2,1],[1,2,1,5],[1,6,1,9],[1,10,1,13],[1,14,1,17],[1,18,1,21],[5,0,7,0],[8,0,19,0],[20,0,22,0],[23,0,28,0],[29,0,30,0]]}
["Fan Failure Thermal Config Matrix",null,null,null,null,null,null,null,null,null,null,null,null,{"$f":"Summary!D15","v":0.91272727272727272},"<-- Margin to PS rating"]
["Notes:\n1.  The 27°C configuration alone is limited to elevations of 900m or less. Altitudes higher than 900m need to be de-rated to ASHRAE Class 2 levels.\n2.  To support system fan redundancy, the system must be configured with two power supplies to maintain sufficient cooling. Concurrent system and power supply fan failures is not supported.\n3.  Processor throttling may occur which may impact system performance. CPU reliability is not impacted.\n4. In fan fail mode, Intel® I/O Modules AXX10GBTWLIOM and AXX2FDRIBIOM are only supported in the specified base system model configured with 120W processors and DRx4 memory.  \n5. Use of the designated PCIe* slot is limited to add-in cards that have air flow requirements of 100 LFM or less. See add-in card specs for air flow requirements.\n6. For ASHRAE Class 3 and Class 4 support, the following power supply margining is required to meet thermal specifications:\na) For dual power supply configurations, the power budget must fit within  a single power supply rated load and be installed in a dual configuration, or\nb) For single power supply configurations, the power budget must be sized with 30% margin to single power supply rated load.\n7. Intel® Xeon Phi™ or non-Intel GPGPU cards may have performance impact during ASHRAE Class 3 and Class 4 ambient air excursions.\n8. PCIe* SSD AIC FF devices can only be supported in the bottom add-in card slot on Riser Slot #1 and Riser Slot #2. \n9. The Intel® RAID Maintenance Free Backup Unit (AXXRMFBUx) can support a case temperature of up to 45°C with the system operating in normal mode and up to 55°C with the system operating in a fan fail mode. The case temperature of Intel® Smart RAID Battery (AXXRSBBUx) can support up to 45°C in both normal and fan fail mode.  Excursions over these specs may result in a reliability impact.  \n10. The system must be configured with Intel® accessory kits AWTCOPRODUCT and A2UL16RISER2 in order to support Intel® Xeon Phi™ or Non-Intel GPGPU add-in cards with passive cooling solutions.",null,"Base System SKUs:\nR1304WT/R1208WT",null,null,null,"Base System SKUs:    R2312WT",null,null,null,"Base System SKUs:      R2224WT",null,null,null,"Base System SKUs:    \nR2308WT R2216WT",null,null,null," Base System SKUs:                 R2208WT",null,null,null,"Base System SKUs:    \nR2308WT R2216WT \nwith AWTCOPRODUCT  ",null,null,null," Base System SKUs:                 R2208WT with duct\nAWTCOPRODUCT"]
[null,null," \"●\"= Full Support without limitation;  \"4,5\"(Cell with number)=Conditional support with limitation;\n\" \"(Blank)=Not support; "]
["ASHRAE (See note 1)","Classifications","27C","A2","A3","A4","27C","A2","A3","A4","27C","A2","A3","A4","27C","A2","A3","A4","27C","A2","A3","A4","27C","A2","A3","A4","27C","A2","A3","A4"]
[null,"Max Ambient","27°C(1)","35°C","40°C","45°C","27°C(1)","35°C","40°C","45°C","27°C(1)","35°C","40°C","45°C","27°C(1)","35°C","40°C","45°C","27°C(1)","35°C","40°C","45°C","27°C(1)","35°C","40°C","45°C","27°C(1)","35°C","40°C","45°C"]
["PS (See note 6)","1100W AC",2,2,null,null,2,2,null,null,2,2,null,null,2,2,null,null,2,2,null,null,2,2,null,null,2,2]
[null,"750W AC",2,2,null,null,2,2,null,null,2,2,null,null,2,2,null,null,2,2,null,null,2,2,null,null,2,2]
[null,"750W DC",2,2,null,null,2,2,null,null,2,2,null,null,2,2,null,null,2,2,null,null,2,2,null,null,2,2]
["EP Processors\n( See Notes 3)","EP, 135w, 12C  (Intel® Xeon® processor E5-2690 V3)","●","●",null,null,"●",3,null,null,"●","●",null,null,"●","●",null,null,"●","●",null,null,3,null,null,null,3,3]
[null,"EP, 120w, 12C  (Intel® Xeon® processor E5-2680 V3, E5-2670 V3)","●","●",null,null,"●",3,null,null,"●","●",null,null,"●","●",null,null,"●","●",null,null,3,null,null,null,3,3]
{"$rows_left_out":52}
{"sheet":"Summary","index":4,"n_rows":34,"n_cols":9,"rows_kept":34,"cut":false,"hidden":false,"merged":[[0,1,0,3]]}
["Power Budget",{"$f":"CONCATENATE(INDEX(Chassis!$L$3:$L$13,'Intel Chassis'!$B3),\" / \",INDEX(Serverboard!A$2:A$13,'Serverboard Config'!$B5) )","v":"R2XXX / (Select Serverboard)"}]
["Chassis/ Power Supply / Cooling:",{"$f":"INDEX(Chassis!A$3:A$13,'Intel Chassis'!$B3)","v":"R2XXX (2U 1100W AC PSU)"}]
["Serverboard:",{"$f":"INDEX(Serverboard!A$2:A$13,'Serverboard Config'!$B5)","v":"(Select Serverboard)"}]
["System Totals"," +12V (amps)","12VSB (amps)","Total System Watts "]
[{"$f":"CONCATENATE(\"Processors - Qty \",'Serverboard Config'!C4, \":\")","v":"Processors - Qty 1:"},{"$f":"SUM('Serverboard Config'!F3)","v":0},{"$f":"SUM('Serverboard Config'!G3)","v":0},{"$f":"SUM('Serverboard Config'!H3)","v":0}]
[{"$f":"CONCATENATE(\"Modules + PCI Cards - Qty \",('Serverboard Config'!B7>1) + ('Serverboard Config'!B8>1) + ('Serverboard Config'!B9>1) + ('Serverboard Config'!B10>1) +('Serverboard Config'!B11>1)+('Serverboard Config'!B12>1)+('Serverboard Config'!B13>1)+('Serverboard Config'!B14>1)+('Serverboard Config'!B16>1)+('Serverboard Config'!B17>1),\":\")","v":"Modules + PCI Cards - Qty 0:"},{"$f":"SUM('Serverboard Config'!F7:F17)","v":0},{"$f":"SUM('Serverboard Config'!G7:G17)","v":0},{"$f":"SUM('Serverboard Config'!H7:H17)","v":0}]
[{"$f":"CONCATENATE(\"HDD/SSD - Qty \",'Intel Chassis'!C4+'Intel Chassis'!C5+'Intel Chassis'!C6,\":\")","v":"HDD/SSD - Qty 0:"},{"$f":"SUM('Intel Chassis'!G4:G6)","v":0},0,{"$f":"SUM('Intel Chassis'!I4:I6)","v":0}]
["Serverboard & Memory:",{"$f":"SUM('Serverboard Config'!F5:F6)","v":0},{"$f":"SUM('Serverboard Config'!G5:G6)","v":0},{"$f":"SUM('Serverboard Config'!H5:H6)","v":0}]
["Chassis & Peripherals:",{"$f":"_Sys12 - B7","v":8},{"$f":"'Intel Chassis'!H15","v":0},{"$f":"3.3*Sys3.3+5*_Sys5+ 12*_Sys12-D7","v":96}]
["System Totals:",{"$f":"SUM(B5:B9)","v":8},{"$f":"SUM(C5:C9)","v":0},{"$f":"SUM(D5:D9)","v":96}]
{"$rows_left_out":25}
{"sheet":"Intel Chassis","index":5,"n_rows":22,"n_cols":11,"rows_kept":22,"cut":false,"hidden":false,"merged":[]}
["Power Budget",{"$f":"CONCATENATE(INDEX(Chassis!$L$3:$L$13,B3), \" System Configuration\")","v":"R2XXX System Configuration"},null,null,null,null,null,null,null,null,"HSBP VRM Efficiency"]
["System Feature","Description","Qty",null,"+3.3V (amps)","+5V (amps)"," +12V (amps)","12V \nstby (amps)","Power\n(watts)",null,{"$f":"INDEX(Chassis!$G$3:$G$13,B3)","v":0.9}]
["Chassis:",6,null,null,null,null,{"$f":"INDEX(Chassis!$E$3:$E$13,B3)+IF(INDEX(Chassis!$F$3:$F$13,B3)=\"Y\",(INDEX(Processors!C2:C28,'Serverboard Config'!B3)*'Serverboard Config'!C4),0)","v":8},null,{"$f":"G3*12+H3*12","v":96}]
["1st HDD/SSD Type: ",1,0,null,null,{"$f":"INDEX(HardDrive!$C$2:$C$19,B4) *C4 * 1","v":0},{"$f":"(INDEX(HardDrive!$D$2:$D$19,B4)*C4+((F4*5)/12)/$K$2) *1","v":0},null,0,{"$f":"IF($C$4+$C$5+$C$6>(INDEX(HardDrive!$F$22:$F$36*$C$7,'Intel Chassis'!$B$7))+(INDEX(HardDrive!$F$22:$F$36*$C$8, $B$8))+(INDEX(HardDrive!$F22:$F$36*$C$9, $B$9)),\" <-- Max Supported HDD Count Exceeded!\",\" \")","v":" "}]
["2nd HDD/SSD Type: ",1,0,null,null,{"$f":"INDEX(HardDrive!$C$2:$C$19,B5) *C5 *1","v":0},{"$f":"(INDEX(HardDrive!$D$2:$D$19,B5) *C5+((F5*5)/12)/$K$2) *1","v":0},null,0,{"$f":"IF($C$4+$C$5+$C$6>(INDEX(HardDrive!$F$22:$F$36*$C$7,'Intel Chassis'!$B$7))+(INDEX(HardDrive!$F$22:$F$36*$C$8, $B$8))+(INDEX(HardDrive!$F23:$F$36*$C$9, $B$9)),\" <-- Max Supported HDD Count Exceeded!\",\" \")","v":" "}]
["3rd HDD/SSD Type: ",1,0,null,null,{"$f":"INDEX(HardDrive!$C$2:$C$19,B6) *C6 *1","v":0},{"$f":"(INDEX(HardDrive!$D$2:$D$19,B6) *C6+((F6*5)/12)/$K$2) *1","v":0},null,0,{"$f":"IF($C$4+$C$5+$C$6>(INDEX(HardDrive!$F$22:$F$36*$C$7,'Intel Chassis'!$B$7))+(INDEX(HardDrive!$F$22:$F$36*$C$8, $B$8))+(INDEX(HardDrive!$F24:$F$36*$C$9, $B$9)),\" <-- Max Supported HDD Count Exceeded!\",\" \")","v":" "}]
[" 1st Backplane Type: ",1,0,null,null,null,{"$f":"(INDEX(HardDrive!$D$22:$D$36,B7) *C7+((F7*5)/12)/$K$2) *1","v":0},null,0]
["2nd Backplane Type: ",1,0,null,null,null,{"$f":"(INDEX(HardDrive!$D$22:$D$36,B8) *C8+((F8*5)/12)/$K$2) *1","v":0},null,{"$f":"G8*12+H8*12","v":0}]
["Rear  Backplane: ",1,0,null,null,null,{"$f":"(INDEX(HardDrive!$B$39:$B$41,B9) *C9+((F9*5)/12)/$K$2) *1","v":0},null,{"$f":"G9*12+H9*12","v":0}]
["Midplane Expander: ",1,1,null,null,null,{"$f":"(INDEX(Peripherals!$D$19:$D$24,B10) *C10) *1","v":0},null,0]
{"$rows_left_out":13}
{"sheet":"Serverboard Config","index":6,"n_rows":32,"n_cols":17,"rows_kept":32,"cut":false,"hidden":false,"merged":[[0,1,0,7]]}
["Power Budget",{"$f":"CONCATENATE(INDEX(Serverboard!A$2:A$13,$B5),\" Configuration\")","v":"(Select Serverboard) Configuration"},null,null,null,null,null,null,null,"CPU VRM Efficiency","Mem VR Efficiency","3.3v VRM Efficiency","5v VRM Efficiency","3.3 Stby VR Efficiency"]
["Serverboard Feature","Description",null,"+3.3V (amps)","+5V (amps)"," +12V (amps)","12V \nstby (amps)","Power (watts)",null,{"$f":"INDEX(Serverboard!E$2:E$11,$B5)","v":1},{"$f":"INDEX(Serverboard!F$2:F$11,$B5)","v":0},{"$f":"INDEX(Serverboard!G$2:G$11,$B5)","v":1},{"$f":"INDEX(Serverboard!H$2:H$11,$B5)","v":1},{"$f":"INDEX(Serverboard!I$2:I$11,$B5)","v":1},"<--Hide these columns"]
["Processors:",1,null,null,null,{"$f":"C4*INDEX(Processors!B$2:B$28,$B3)/12/VRMefficiency*0.9","v":0},null,{"$f":"F3*12+E3*5","v":0}]
[null,"Quantity:",1]
["Serverboard:",1,null,null,null,{"$f":"INDEX(Serverboard!B$2:B$13,$B5) *1","v":0},{"$f":"INDEX(Serverboard!C$2:C$13,$B5) *1","v":0},{"$f":"INDEX(Serverboard!D$2:D$13,$B5) *1","v":0}]
["Memory:",1,1,null,null,{"$f":"IF(C6=1,0,((HLOOKUP(INDEX(Memory!A31:A41,$C6),Memory!B5:I21,B6+2,FALSE))/12/_MemVR*0.9))","v":0},null,{"$f":"D6*3.3+E6*5+F6*12+G6*12","v":0},{"$f":"IF(C6=1,\"\",IF(HLOOKUP(INDEX(Memory!A31:A41,$C6),Memory!B5:I21,B6+2,FALSE)=\"na\",\"<-- unsupported DIMM config\",\"\"))","v":""}]
["PCI Card #1:",1,null,{"$f":"INDEX(PCI!B$3:B$22,$B7)","v":0},{"$f":"INDEX(PCI!C$3:C$22,$B7)","v":0},{"$f":"INDEX(PCI!D$3:D$22,$B7)+((D7*3.3)/12)/$L$2+((E7*5)/12)/$M$2","v":0},{"$f":"((INDEX(PCI!$E$3:$E$22,$B7)*3.3)+(INDEX(PCI!$F$3:$F$22,$B7))*5)/12/_stbyVRM","v":0},{"$f":"F7*12+G7*12","v":0}]
["PCI Card #2:",1,null,{"$f":"INDEX(PCI!B$3:B$22,$B8)","v":0},{"$f":"INDEX(PCI!C$3:C$22,$B8)","v":0},{"$f":"INDEX(PCI!D$3:D$22,$B8)+((D8*3.3)/12)/$L$2+((E8*5)/12)/$M$2","v":0},{"$f":"((INDEX(PCI!$E$3:$E$22,$B8)*3.3)+(INDEX(PCI!$F$3:$F$22,$B8))*5)/12/_stbyVRM","v":0},0]
["PCI Card #3:",1,null,{"$f":"INDEX(PCI!B$3:B$22,$B9)","v":0},{"$f":"INDEX(PCI!C$3:C$22,$B9)","v":0},{"$f":"INDEX(PCI!D$3:D$22,$B9)+((D9*3.3)/12)/$L$2+((E9*5)/12)/$M$2","v":0},{"$f":"((INDEX(PCI!$E$3:$E$22,$B9)*3.3)+(INDEX(PCI!$F$3:$F$22,$B9))*5)/12/_stbyVRM","v":0},0]
["PCI Card #4:",1,null,{"$f":"INDEX(PCI!B$3:B$22,$B10)","v":0},{"$f":"INDEX(PCI!C$3:C$22,$B10)","v":0},{"$f":"INDEX(PCI!D$3:D$22,$B10)+((D10*3.3)/12)/$L$2+((E10*5)/12)/$M$2","v":0},{"$f":"((INDEX(PCI!$E$3:$E$22,$B10)*3.3)+(INDEX(PCI!$F$3:$F$22,$B10))*5)/12/_stbyVRM","v":0},0]
{"$rows_left_out":23}
{"sheet":"Serverboard","index":7,"n_rows":11,"n_cols":10,"rows_kept":11,"cut":false,"hidden":false,"merged":[]}
["Serverboard",12,"12VSB","Watts","CPU VR\nEff%","Mem VR Eff%","5v VR\nEff%","3v VR\nEff%","Stby/Aux Eff%"]
["(Select Serverboard)",null,null,null,1,null,1,1,1]
["Intel® Server Board S2600WT2",{"$f":"62/12","v":5.166666666666667},{"$f":"2.1/12","v":0.17500000000000002},{"$f":"B3*12+C3*12","v":64.099999999999994},0.88,0.88,0.85,0.9,0.87]
["Intel® Server Board S2600WTT",{"$f":"62/12","v":5.166666666666667},{"$f":"2.1/12","v":0.17500000000000002},{"$f":"B4*12+C4*12","v":64.099999999999994},0.88,0.88,0.85,0.9,0.87]
[null,null,null,{"$f":"B5*12+C5*12","v":0},0.8,0.8,0.8,0.8,0.8,"<-- Define Custom Numbers Here"]
[null,null,null,0,0.8,0.8,0.8,0.8,0.8,"<-- Define Custom Numbers Here"]
[null,null,null,0,0.8,0.8,0.8,0.8,0.8,"<-- Define Custom Numbers Here"]
[null,null,null,0,0.8,0.8,0.8,0.8,0.8,"<-- Define Custom Numbers Here"]
[null,null,null,0,0.8,0.8,0.8,0.8,0.8,"<-- Define Custom Numbers Here"]
[null,null,null,0,0.8,0.8,0.8,0.8,0.8,"<-- Define Custom Numbers Here"]
{"$rows_left_out":2}
{"sheet":"Chassis","index":8,"n_rows":18,"n_cols":21,"rows_kept":18,"cut":false,"hidden":false,"merged":[[0,1,0,2],[0,16,0,19],[0,12,0,15],[0,7,0,10]]}
["Chassis",null,null,"Total","Fans","HS Fan","HSBP ","PS Eff%",null,null,null,"Product Name","Total 12 DC Current (Amps)",null,null,null,"Total DC Ouput (Watts)"]
["Selection","12V","12VSB","Watts","12V","(Y/N)","VR Eff%","220VAC","115VAC","-48DCV","-60DCV",null,"220VAC","115VAC","-48DCV","-60DCV","220VAC","115VAC","-48DCV","-60DCV"]
["(Select Chassis)",null,null,null,null,null,1,1,1,1,1,"(Select a Chassis)"]
["R1XXX (1U 750W AC PSU)",{"$f":"INDEX(M4:P4,Summary!$B$19)","v":62},2.1,{"$f":"INDEX(Q4:T4,Summary!$B$19)","v":750},{"$f":"6*2.1","v":12.600000000000001},"N",0.9,0.94,0.92,null,null,"R1XXX",62,62,null,null,750,750]
["R1XXX (1U 750W DC PSU)",{"$f":"INDEX(M5:P5,Summary!$B$19)","v":0},2.1,{"$f":"INDEX(Q5:T5,Summary!$B$19)","v":0},{"$f":"6*2.1","v":12.600000000000001},"N",0.9,null,null,0.9,0.9,"R1XXX",null,null,62,62,null,null,750,750]
["R2XXX (2U 750W AC PSU)",{"$f":"INDEX(M6:P6,Summary!$B$19)","v":62},2.1,{"$f":"INDEX(Q6:T6,Summary!$B$19)","v":750},{"$f":"5*1.6","v":8},"Y",0.9,0.94,0.92,null,null,"R2XXX",62,62,null,null,750,750]
["R2XXX (2U 750W DC PSU)",{"$f":"INDEX(M7:P7,Summary!$B$19)","v":0},2.1,{"$f":"INDEX(Q7:T7,Summary!$B$19)","v":0},{"$f":"5*1.6","v":8},"Y",0.9,null,null,0.9,0.9,"R2XXX",null,null,62,62,null,null,750,750]
["R2XXX (2U 1100W AC PSU)",{"$f":"INDEX(M8:P8,Summary!$B$19)","v":92},2.1,{"$f":"INDEX(Q8:T8,Summary!$B$19)","v":1100},{"$f":"5*1.6","v":8},"Y",0.9,0.94,0.92,null,null,"R2XXX",92,75,null,null,1100,900]
["User Definable",{"$f":"INDEX(M9:P9,Summary!$B$19)","v":0},null,{"$f":"INDEX(Q9:T9,Summary!$B$19)","v":0},null,"N",0.8,0.8,0.8,0.8,0.8,null,null,null,null,null,null,null,null,null,"<-- Define Custom Numbers Here"]
["User Definable",{"$f":"INDEX(M10:P10,Summary!$B$19)","v":0},null,{"$f":"INDEX(Q10:T10,Summary!$B$19)","v":0},null,"N",0.8,0.8,0.8,0.8,0.8,null,null,null,null,null,null,null,null,null,"<-- Define Custom Numbers Here"]
{"$rows_left_out":9}
{"sheet":"Processors","index":9,"n_rows":38,"n_cols":6,"rows_kept":38,"cut":false,"hidden":false,"merged":[]}
["Processor Types","TDP (W)","HS Fan (A)","Source",null,"VRM#1"]
["(Select Processor)",null,null,null,null,"5V VRM"]
["Intel Xeon® E5-2699 v3 (145W)",145,null,"EDS rev1.7 - Intel Doc #507851"]
["Intel Xeon® E5-2698 v3 (135W)",135,null,"EDS rev1.7 - Intel Doc #507851"]
["Intel Xeon® E5-2697 v3 (145W)",145,null,"EDS rev1.7 - Intel Doc #507851"]
["Intel Xeon® E5-2695 v3 (120W)",120,null,"EDS rev1.7 - Intel Doc #507851"]
["Intel Xeon® E5-2690 v3 (135W)",135,null,"EDS rev1.7 - Intel Doc #507851"]
["Intel Xeon® E5-2683 v3 (120W)",120,null,"EDS rev1.7 - Intel Doc #507851"]
["Intel Xeon® E5-2680 v3 (120W)",120,null,"EDS rev1.7 - Intel Doc #507851"]
["Intel Xeon® E5-2670 v3 (120W)",120,null,"EDS rev1.7 - Intel Doc #507851"]
{"$rows_left_out":29}
{"sheet":"Memory","index":10,"n_rows":41,"n_cols":15,"rows_kept":41,"cut":false,"hidden":false,"merged":[[3,1,3,8],[0,1,0,8],[4,12,4,14]]}
[null,"Watts of +12V"]
[]
[null,"1DPC","1DPC","1DPC","1DPC","1&2DPC","2DPC","2&3DPC","3DPC"]
[null,"# of DIMMS"]
["Memory",1,2,4,8,12,16,20,24,null,null,null,"TDP"]
[]
["(Select Memory)",null,null,null,null,null,null,null,null,null,null,null,"1DPC","2DPC","3DPC"]
["4GB DDR4 RDIMM (4Gb, SRx8)",{"$f":"M8*B$5","v":3.2},{"$f":"M8*C$5","v":6.4},{"$f":"M8*D$5","v":12.8},{"$f":"M8*E$5","v":25.6},{"$f":"M8*4 +N8*8","v":32},{"$f":"N8*16","v":38.4},{"$f":"N8*16+O8*4","v":45.6},{"$f":"O8*24","v":43.2},null,null,null,3.2,2.4,1.8]
["8GB DDR4 RDIMM (4Gb, SRx4)",{"$f":"M9*B$5","v":3.8},{"$f":"M9*C$5","v":7.6},{"$f":"M9*D$5","v":15.2},{"$f":"M9*E$5","v":30.4},{"$f":"M9*4 +N9*8","v":39.200000000000003},{"$f":"N9*16","v":48},{"$f":"N9*16+O9*4","v":57.6},{"$f":"O9*24","v":57.599999999999994},null,null,null,3.8,3,2.4]
["8GB DDR4 RDIMM (8Gb, SRx8)",{"$f":"M10*B$5","v":3.2},{"$f":"M10*C$5","v":6.4},{"$f":"M10*D$5","v":12.8},{"$f":"M10*E$5","v":25.6},{"$f":"M10*4 +N10*8","v":32},{"$f":"N10*16","v":38.4},{"$f":"N10*16+O10*4","v":46},{"$f":"O10*24","v":45.599999999999994},null,null,null,3.2,2.4,1.9]
{"$rows_left_out":32}
{"sheet":"PCI","index":11,"n_rows":58,"n_cols":8,"rows_kept":58,"cut":false,"hidden":false,"merged":[]}
[null,"Amps of +3.3V","Amps of +5V","Amps of +12V","Amps of    3.3V Stby","Amps of    5V Stby","Watts"]
["PCI Add in Cards"]
["Slot Empty",null,null,null,null,null," "]
["PCI-X (5V) Typical",null,2,null,null,null,{"$f":"B4*3.3+C4*5+D4*12+E4*3.3+F4*5","v":10}]
["PCIe (3V) Typical",3,null,null,null,null,9.8999999999999986]
["PCIe (3.3V / 12V) Typical",2,null,0.25,null,null,9.6]
["PCIe (3.3V / 12V) High",2,null,0.7,null,null,14.999999999999998]
["RS3DC080",0.79300000000000004,null,1.0900000000000001,1E-3,null,15.700200000000001]
["RES3FV288",null,null,1.04,null,null,12.48]
["PCIe SSD AIC (Cabled)",0.36,null,0.92,2E-3,null,12.234600000000002]
{"$rows_left_out":49}
{"sheet":"HardDrive","index":12,"n_rows":41,"n_cols":7,"rows_kept":41,"cut":false,"hidden":false,"merged":[]}
["Hard Drives","Amps of +3.3V","Amps of +5V","Amps of +12V","Watts"]
["Empty"]
["3.5\" SATA Typical Power (12W)",null,0.44,0.78,{"$f":"B3*3.3+C3*5+D3*12","v":11.559999999999999}]
["3.5\" SAS Typical Power (12W)",null,0.6,0.76,{"$f":"B4*3.3+C4*5+D4*12","v":12.120000000000001}]
["2.5\" SATA Typical Power (5W)",null,1,0,5]
["2.5\" SAS Typical Power (9W)",null,0.81,0.41,8.9700000000000006]
["Intel® PCIe SSD DC P3700",null,null,2.08,24.96]
["Intel® SSD DC S3700 Series SSDSC2BA800G3",null,1.1499999999999999,0.5,11.75]
["Intel® SSD DC S3500 Series SSDSC2BB080G4 ",null,0.4,0.18,4.16]
["3.5\" SAS Seagate ST3000NM0043 Constellation ES.3",null,0.44,0.71,{"$f":"B10*3.3+C10*5+D10*12","v":10.719999999999999},null,"<-- Define Custom Device Here"]
{"$rows_left_out":32}
{"sheet":"Peripherals","index":13,"n_rows":24,"n_cols":7,"rows_kept":24,"cut":false,"hidden":false,"merged":[]}
["Misc Peripherals","Amps of +3.3V","Amps of +5V","Amps of +12V","Amps of 3VSB","Watts"]
["Slim-Line Devices"]
["Empty"]
["AXXSATADVDROM",null,0.7,null,null,{"$f":"B4*3.3+C4*5+D4*12++E4*3.3","v":3.5}]
["AXXSATADVDRWROM",null,0.8,null,null,{"$f":"B5*3.3+C5*5+D5*12++E5*3.3","v":4}]
["User Definable",null,null,null,null,0,"<-- Define Custom Peripherals Here"]
["User Definable",null,null,null,null,0,"<-- Define Custom Peripherals Here"]
["User Definable",null,null,null,null,0,"<-- Define Custom Peripherals Here"]
["User Definable",null,null,null,null,0,"<-- Define Custom Peripherals Here"]
[]
{"$rows_left_out":15}
{"sheet":"Revision","index":14,"n_rows":11,"n_cols":4,"rows_kept":11,"cut":false,"hidden":false,"merged":[]}
[{"$f":"MAX(A4:A27)","v":"2014-10-01"},{"$f":"MAX(B4:B27)","v":1.1000000000000001},null,"<=== Linked to Summary Tab."]
[]
["Date","Rev","Notes","Init"]
["2013-09-23",0.1,"Initial Draft - working copy","mj"]
["2014-02-04",0.5,"Beta release for review","mj"]
["2014-02-25",0.6,"Updated Haswell CPU list, Feedback from Dan.","mj"]
["2014-06-25",0.8,"Updated for Silver","mj"]
["2014-07-22",0.9,"Final draft updates, adding AP list items and final power data for components.  French and Truches Valley, RAID modules (UC question.)","mj"]
["2014-09-02",1,"Final thermal config tables updated.  Prepared tool for external release.  Updated Thermal Configuration notes.","mj"]
["2014-09-03",1.1000000000000001,"Add third HDD type to 'Configure System' page.  \nPower updated for AXX1P40FRTIOM and AXX2P40FRTIOM.\nFan Fail Config updated due to addition of 1U support truss.","mj"]
{"$rows_left_out":1}